Target
Carbonic anhydrase 1
Ligand
BDBM50087042
Substrate
Meas. Tech.
ChEMBL_1477826 (CHEMBL3428830)
Ki
>10000±n/a nM
Citation
 Grandane, ATanc, MDi Cesare Mannelli, LCarta, FGhelardini, C?alubovskis, RSupuran, CT 6-Substituted sulfocoumarins are selective carbonic anhdydrase IX and XII inhibitors with significant cytotoxicity against colorectal cancer cells. J Med Chem 58:3975-83 (2015)  
Target
Name:
Carbonic anhydrase 1
Synonyms:
CA-I CAB Carbonate dehydratase I Carbonic anhydrase 1 (CA I) Carbonic anhydrase 1 (Recombinant CA I) Carbonic anhydrase B Carbonic anhydrase I (CA I) Carbonic anhydrase I (CAI) Carbonic anhydrase isoenzyme I (hCA I) | hCA
Type:
Enzyme
Mol. Mass.:
28873.37
Organism:
Homo sapiens (Human)
Description:
P00915
Residue:
261
  
Inhibitor
Name:
BDBM50087042
Synonyms:
CHEMBL3426542
Type:
Small organic molecule
Emp. Form.:
C9H5NO3S
Mol. Mass.:
207.206
SMILES:
O=S1(=O)Oc2ccc(cc2C=C1)C#N
: