Target
Carbonic anhydrase 12
Ligand
BDBM50087043
Substrate
Meas. Tech.
ChEMBL_1477829 (CHEMBL3428964)
Ki
11±n/a nM
Citation
 Grandane, ATanc, MDi Cesare Mannelli, LCarta, FGhelardini, C?alubovskis, RSupuran, CT 6-Substituted sulfocoumarins are selective carbonic anhdydrase IX and XII inhibitors with significant cytotoxicity against colorectal cancer cells. J Med Chem 58:3975-83 (2015)  
Target
Name:
Carbonic anhydrase 12
Synonyms:
CA-XII CAH12_HUMAN Carbonic anhydrase Carbonic anhydrase XII Carbonic anhydrase XII (CAXII) | Tumor antigen HOM-RCC-3.1.3
Type:
Enzyme
Mol. Mass.:
39456.00
Organism:
Homo sapiens (Human)
Description:
Catalytic domain of human cloned isozyme was used in the assay
Residue:
354
  
Inhibitor
Name:
BDBM50087043
Synonyms:
CHEMBL3426541
Type:
Small organic molecule
Emp. Form.:
C9H8O4S
Mol. Mass.:
212.222
SMILES:
COc1ccc2OS(=O)(=O)C=Cc2c1
: