Target
Potassium voltage-gated channel subfamily E/KQT member 1
Ligand
BDBM50146710
Substrate
Meas. Tech.
ChEMBL_1478575 (CHEMBL3430476)
IC50
501187±n/a nM
Citation
 Mirams, GRDavies, MRBrough, SJBridgland-Taylor, MHCui, YGavaghan, DJAbi-Gerges, N Prediction of Thorough QT study results using action potential simulations based on ion channel screens. J Pharmacol Toxicol Methods 70:246-54 (2014)  
Target
Name:
Potassium voltage-gated channel subfamily E/KQT member 1
Synonyms:
Voltage-gated potassium channel beta subunit Mink/subunit Kv7.1 | Voltage-gated potassium channel, IKs; KCNQ1(Kv7.1)/KCNE1(MinK)
Type:
Mol. Mass.:
Description:
ASSAY_ID of EBI is 158552
Components:
This complex has 2 components.
Component 1
Name:
Potassium voltage-gated channel subfamily E member 1
Synonyms:
Delayed rectifier potassium channel subunit IsK KCNE1 KCNQ1(Kv7.1)/KCNE1(MinK) Voltage-gated potassium channel beta subunit Mink | Voltage-gated potassium channel, IKs
Type:
PROTEIN
Mol. Mass.:
14676.11
Organism:
Homo sapiens (Human)
Description:
ChEMBL_1456351
Residue:
129
  
Component 2
Name:
Potassium voltage-gated channel subfamily KQT member 1
Synonyms:
KCNA8 KCNQ (Kv7) potassium channel KCNQ1_HUMAN Voltage-gated potassium channel subunit Kv7.1 | Voltage-gated potassium channel subunit Kv7.1/Misshapen-like kinase 1
Type:
PROTEIN
Mol. Mass.:
74739.00
Organism:
Homo sapiens (Human)
Description:
ChEMBL_1454245
Residue:
676
  
Inhibitor
Name:
BDBM50146710
Synonyms:
(S)-2-(4,6-Dimethyl-pyrimidin-2-yloxy)-3-methoxy-3,3-diphenyl-propionic acid CHEMBL1111 | Letairis
Type:
Small organic molecule
Emp. Form.:
C22H22N2O4
Mol. Mass.:
378.4211
SMILES:
COC([C@H](Oc1nc(C)cc(C)n1)C(O)=O)(c1ccccc1)c1ccccc1
: