Target
Potassium voltage-gated channel subfamily E/KQT member 1
Ligand
BDBM50033110
Substrate
Meas. Tech.
ChEMBL_1478573 (CHEMBL3430474)
IC50
125893±n/a nM
Citation
 Mirams, GRDavies, MRBrough, SJBridgland-Taylor, MHCui, YGavaghan, DJAbi-Gerges, N Prediction of Thorough QT study results using action potential simulations based on ion channel screens. J Pharmacol Toxicol Methods 70:246-54 (2014)  
Target
Name:
Potassium voltage-gated channel subfamily E/KQT member 1
Synonyms:
Voltage-gated potassium channel beta subunit Mink/subunit Kv7.1 | Voltage-gated potassium channel, IKs; KCNQ1(Kv7.1)/KCNE1(MinK)
Type:
Mol. Mass.:
Description:
ASSAY_ID of EBI is 158552
Components:
This complex has 2 components.
Component 1
Name:
Potassium voltage-gated channel subfamily E member 1
Synonyms:
Delayed rectifier potassium channel subunit IsK KCNE1 KCNQ1(Kv7.1)/KCNE1(MinK) Voltage-gated potassium channel beta subunit Mink | Voltage-gated potassium channel, IKs
Type:
PROTEIN
Mol. Mass.:
14676.11
Organism:
Homo sapiens (Human)
Description:
ChEMBL_1456351
Residue:
129
  
Component 2
Name:
Potassium voltage-gated channel subfamily KQT member 1
Synonyms:
KCNA8 KCNQ (Kv7) potassium channel KCNQ1_HUMAN Voltage-gated potassium channel subunit Kv7.1 | Voltage-gated potassium channel subunit Kv7.1/Misshapen-like kinase 1
Type:
PROTEIN
Mol. Mass.:
74739.00
Organism:
Homo sapiens (Human)
Description:
ChEMBL_1454245
Residue:
676
  
Inhibitor
Name:
BDBM50033110
Synonyms:
ALFUZOSIN N-{3-[(4-amino-6,7-dimethoxyquinazolin-2-yl)(methyl)amino]propyl}tetrahydrofuran-2-carboxamide
Type:
Small organic molecule
Emp. Form.:
C19H27N5O4
Mol. Mass.:
389.4488
SMILES:
COc1cc2nc(nc(N)c2cc1OC)N(C)CCCNC(=O)C1CCCO1
: