Target
Bile salt export pump
Ligand
BDBM50103508
Substrate
Meas. Tech.
ChEMBL_1481883 (CHEMBL3540574)
IC50
32200±n/a nM
Citation
 Dawson, SStahl, SPaul, NBarber, JKenna, JG In vitro inhibition of the bile salt export pump correlates with risk of cholestatic drug-induced liver injury in humans. Drug Metab Dispos 40:130-8 (2011)  
Target
Name:
Bile salt export pump
Synonyms:
ABCBB_RAT Abcb11 Bile salt export pump Sister of P-glycoprotein | Spgp
Type:
PROTEIN
Mol. Mass.:
146267.86
Organism:
Rattus norvegicus
Description:
ChEMBL_1481883
Residue:
1321
  
Inhibitor
Name:
BDBM50103508
Synonyms:
CHEBI:31653 Glaphenine R-1707
Type:
Small organic molecule
Emp. Form.:
C19H17ClN2O4
Mol. Mass.:
372.802
SMILES:
OCC(O)COC(=O)c1ccccc1Nc1ccnc2cc(Cl)ccc12
: