Target
Cytochrome P450 3A4
Ligand
BDBM50088485
Substrate
Meas. Tech.
ChEMBL_1489010 (CHEMBL3536359)
IC50
4.0±n/a nM
Citation
 Peng, CCShi, WLutz, JDKunze, KLLiu, JONelson, WLIsoherranen, N Stereospecific metabolism of itraconazole by CYP3A4: dioxolane ring scission of azole antifungals. Drug Metab Dispos 40:426-35 (2012)  
Target
Name:
Cytochrome P450 3A4
Synonyms:
Albendazole monooxygenase CP3A4_HUMAN CYP3A4 CYPIIIA4 Cytochrome P450 3A4 (CYP3A4) Nifedipine oxidase Taurochenodeoxycholate 6-alpha-hydroxylase
Type:
Enzyme
Mol. Mass.:
57349.57
Organism:
Homo sapiens (Human)
Description:
Residue:
503
  
Inhibitor
Name:
BDBM50088485
Synonyms:
CHEMBL1835949
Type:
Small organic molecule
Emp. Form.:
C35H38Cl2N8O4
Mol. Mass.:
705.633
SMILES:
CC[C@H](C)n1ncn(-c2ccc(cc2)N2CCN(CC2)c2ccc(OC[C@@H]3CO[C@](Cn4cncn4)(O3)c3ccc(Cl)cc3Cl)cc2)c1=O
: