Target
Nuclear receptor subfamily 1 group I member 2
Ligand
BDBM50088383
Substrate
Meas. Tech.
ChEMBL_1487572 (CHEMBL3531878)
EC50
28200±n/a nM
Citation
 Shukla, SJSakamuru, SHuang, RMoeller, TAShinn, PVanleer, DAuld, DSAustin, CPXia, M Identification of clinically used drugs that activate pregnane X receptors. Drug Metab Dispos 39:151-9 (2010)  
Target
Name:
Nuclear receptor subfamily 1 group I member 2
Synonyms:
NR1I2 Orphan nuclear receptor PAR1 PXR SXR nuclear receptor subfamily 1 group I member 2 isoform 1
Type:
Nuclear receptor
Mol. Mass.:
49774.77
Organism:
Homo sapiens (Human)
Description:
O75469
Residue:
434
  
Inhibitor
Name:
BDBM50088383
Synonyms:
Amlodipine Norvasc
Type:
Small organic molecule
Emp. Form.:
C20H25ClN2O5
Mol. Mass.:
408.876
SMILES:
CCOC(=O)C1=C(COCCN)NC(C)=C(C1c1ccccc1Cl)C(=O)OC
: