Target
Nuclear receptor subfamily 1 group I member 2
Ligand
BDBM50146710
Substrate
Meas. Tech.
ChEMBL_1487564 (CHEMBL3531531)
EC50
31600±n/a nM
Citation
 Shukla, SJSakamuru, SHuang, RMoeller, TAShinn, PVanleer, DAuld, DSAustin, CPXia, M Identification of clinically used drugs that activate pregnane X receptors. Drug Metab Dispos 39:151-9 (2010)  
Target
Name:
Nuclear receptor subfamily 1 group I member 2
Synonyms:
NR1I2 Orphan nuclear receptor PAR1 PXR SXR nuclear receptor subfamily 1 group I member 2 isoform 1
Type:
Nuclear receptor
Mol. Mass.:
49774.77
Organism:
Homo sapiens (Human)
Description:
O75469
Residue:
434
  
Inhibitor
Name:
BDBM50146710
Synonyms:
(S)-2-(4,6-Dimethyl-pyrimidin-2-yloxy)-3-methoxy-3,3-diphenyl-propionic acid CHEMBL1111 | Letairis
Type:
Small organic molecule
Emp. Form.:
C22H22N2O4
Mol. Mass.:
378.4211
SMILES:
COC([C@H](Oc1nc(C)cc(C)n1)C(O)=O)(c1ccccc1)c1ccccc1
: