Target
Sulfotransferase 1A1
Ligand
BDBM50187243
Substrate
Meas. Tech.
ChEMBL_1484214 (CHEMBL3537875)
Ki
19±n/a nM
Citation
 Rohn, KJCook, ITLeyh, TSKadlubar, SAFalany, CN Potent inhibition of human sulfotransferase 1A1 by 17a-ethinylestradiol: role of 3'-phosphoadenosine 5'-phosphosulfate binding and structural rearrangements in regulating inhibition and activity. Drug Metab Dispos 40:1588-95 (2012)  
Target
Name:
Sulfotransferase 1A1
Synonyms:
Aryl sulfotransferase 1 P-PST 1 Phenol-sulfating phenol sulfotransferase 1 ST1A1_HUMAN STP STP1 Sulfotransferase 1A1 Thermostable phenol sulfotransferase | Ts-PST
Type:
Enzyme
Mol. Mass.:
34165.45
Organism:
Homo sapiens (Human)
Description:
P50225
Residue:
295
  
Inhibitor
Name:
BDBM50187243
Synonyms:
17-ethinyl-3,17-estradiol 17-ethinylestradiol 17alpha-ethynylestra-1,3,5(10)-triene-3,17beta-diol CHEMBL691 Ethinylestradiol ethinyloestradiol
Type:
Small organic molecule
Emp. Form.:
C20H24O2
Mol. Mass.:
296.4034
SMILES:
C[C@]12CC[C@H]3[C@@H](CCc4cc(O)ccc34)[C@@H]1CC[C@@]2(O)C#C
: