Target
Neutral amino acid transporter B(0)
Ligand
BDBM50088535
Substrate
Meas. Tech.
ChEMBL_1495669 (CHEMBL3578657)
IC50
436000±n/a nM
Citation
 Schulte, MLDawson, ESSaleh, SACuthbertson, MLManning, HC 2-Substituted N¿-glutamylanilides as novel probes of ASCT2 with improved potency. Bioorg Med Chem Lett 25:113-6 (2014)  
Target
Name:
Neutral amino acid transporter B(0)
Synonyms:
AAAT_HUMAN ASCT2 Baboon M7 virus receptor Neutral amino acid transporter B(0) RDR SLC1A5 Solute carrier family 1 member 5
Type:
PROTEIN
Mol. Mass.:
56592.12
Organism:
Homo sapiens (Human)
Description:
ChEMBL_109758
Residue:
541
  
Inhibitor
Name:
BDBM50088535
Synonyms:
CHEMBL3576928 | US10189805, Compound 4
Type:
Small organic molecule
Emp. Form.:
C18H17N3O3S
Mol. Mass.:
355.411
SMILES:
N[C@@H](CCC(=O)Nc1ccccc1-c1nc2ccccc2s1)C(O)=O
: