Target
5-hydroxytryptamine receptor 2A
Ligand
BDBM50018958
Substrate
Meas. Tech.
ChEMBL_1496593 (CHEMBL3578859)
Ki
25000±n/a nM
Citation
 Weichert, DBanerjee, AHiller, CKling, RCHübner, HGmeiner, P Molecular determinants of biased agonism at the dopamine D2 receptor. J Med Chem 58:2703-17 (2015)  
Target
Name:
5-hydroxytryptamine receptor 2A
Synonyms:
5-HT-2 5-HT2A 5-hydroxytryptamine receptor 2A (5HT-2A) 5HT2A_HUMAN HTR2A | Serotonin receptor 2A
Type:
undefined
Mol. Mass.:
52607.65
Organism:
Homo sapiens (Human)
Description:
P28223
Residue:
471
  
Inhibitor
Name:
BDBM50018958
Synonyms:
CHEBI:75401 | QUINPIROLE
Type:
Small organic molecule
Emp. Form.:
C13H21N3
Mol. Mass.:
219.3259
SMILES:
[H][C@]12CCCN(CCC)[C@]1([H])Cc1c[nH]nc1C2
: