Target
D(2) dopamine receptor
Ligand
BDBM50018958
Substrate
Meas. Tech.
ChEMBL_1496601 (CHEMBL3578967)
EC50
2800±n/a nM
Citation
 Weichert, DBanerjee, AHiller, CKling, RCHübner, HGmeiner, P Molecular determinants of biased agonism at the dopamine D2 receptor. J Med Chem 58:2703-17 (2015)  
Target
Name:
D(2) dopamine receptor
Synonyms:
D(2) dopamine receptor DOPAMINE D2 Long DRD2 Dopamine D2 receptor Dopamine D2 receptor (D2R) Dopamine2-like | d2
Type:
Cell-surface receptors
Mol. Mass.:
50647.10
Organism:
Homo sapiens (Human)
Description:
P14416
Residue:
443
  
Inhibitor
Name:
BDBM50018958
Synonyms:
CHEBI:75401 | QUINPIROLE
Type:
Small organic molecule
Emp. Form.:
C13H21N3
Mol. Mass.:
219.3259
SMILES:
[H][C@]12CCCN(CCC)[C@]1([H])Cc1c[nH]nc1C2
: