Target
ATP-dependent translocase ABCB1
Ligand
BDBM50091138
Substrate
Meas. Tech.
ChEMBL_1500057 (CHEMBL3584053)
EC50
108±n/a nM
Citation
 Wong, ILWang, BCYuan, JDuan, LXLiu, ZLiu, TLi, XMHu, XZhang, XYJiang, TWan, SBChow, LM Potent and Nontoxic Chemosensitizer of P-Glycoprotein-Mediated Multidrug Resistance in Cancer: Synthesis and Evaluation of Methylated Epigallocatechin, Gallocatechin, and Dihydromyricetin Derivatives. J Med Chem 58:4529-49 (2015)  
Target
Name:
ATP-dependent translocase ABCB1
Synonyms:
ABCB1 MDR1_HUMAN Multidrug resistance protein 1 P-glycoprotein (P-gp) PGY1
Type:
Protein
Mol. Mass.:
141503.50
Organism:
Homo sapiens (Human)
Description:
P08183
Residue:
1280
  
Inhibitor
Name:
BDBM50091138
Synonyms:
CHEMBL3582168
Type:
Small organic molecule
Emp. Form.:
C37H38FNO12
Mol. Mass.:
707.6955
SMILES:
COc1cc(OC)c2C[C@H](OC(=O)c3ccc(F)c(NC(=O)c4cc(OC)c(OC)c(OC)c4)c3)[C@H](Oc2c1)c1cc(OC)c(OC)c(OC)c1
: