Target
Alpha-1A adrenergic receptor
Ligand
BDBM50091350
Substrate
Meas. Tech.
ChEMBL_1497770 (CHEMBL3583290)
IC50
0.600000±n/a nM
Citation
 Zhang, WMa, ZLi, WLi, GChen, LLiu, ZDu, LLi, M Discovery of Quinazoline-Based Fluorescent Probes toa1-Adrenergic Receptors. ACS Med Chem Lett 6:502-6 (2015)  
Target
Name:
Alpha-1A adrenergic receptor
Synonyms:
ADA1A_HUMAN ADRA1C Alpha 1A-adrenoceptor Alpha adrenergic receptor 1a Alpha-adrenergic receptor 1c adrenergic Alpha1 | adrenergic Alpha1C
Type:
Cell-surface receptors
Mol. Mass.:
51511.67
Organism:
Homo sapiens (Human)
Description:
P35348
Residue:
466
  
Inhibitor
Name:
BDBM50091350
Synonyms:
CHEMBL3582270
Type:
Small organic molecule
Emp. Form.:
C30H33N9O5
Mol. Mass.:
599.6403
SMILES:
CCN(CC)c1ccc2cc(-n3cc(nn3)C(=O)N3CCN(CC3)c3nc(N)c4cc(OC)c(OC)cc4n3)c(=O)oc2c1
: