Target
Bromodomain-containing protein 3
Ligand
BDBM50380682
Substrate
Meas. Tech.
ChEMBL_1498186 (CHEMBL3583406)
Ki
22±n/a nM
Citation
 Ran, XZhao, YLiu, LBai, LYang, CYZhou, BMeagher, JLChinnaswamy, KStuckey, JAWang, S Structure-Based Design of¿-Carboline Analogues as Potent and Specific BET Bromodomain Inhibitors. J Med Chem 58:4927-39 (2015)  
Target
Name:
Bromodomain-containing protein 3
Synonyms:
BRD3 Bromodomain and extra-terminal motif (BET) Bromodomain-containing protein 3 (BRD3) RING3-like protein | RING3L
Type:
Protein
Mol. Mass.:
79571.81
Organism:
Homo sapiens (Human)
Description:
Q15059
Residue:
726
  
Inhibitor
Name:
BDBM50380682
Synonyms:
CHEMBL2017291 | I-BET151 (16)
Type:
Small organic molecule
Emp. Form.:
C23H21N5O3
Mol. Mass.:
415.4445
SMILES:
COc1cc2c3n([C@H](C)c4ccccn4)c(=O)[nH]c3cnc2cc1-c1c(C)noc1C
: