Target
Beta-secretase 1
Ligand
BDBM50092469
Substrate
Meas. Tech.
ChEMBL_1500714 (CHEMBL3588064)
IC50
36100±n/a nM
Citation
 Winneroski, LLSchiffler, MAErickson, JAMay, PCMonk, SATimm, DEAudia, JEBeck, JPBoggs, LNBorders, ARBoyer, RDBrier, RAHudziak, KJKlimkowski, VJGarcia Losada, PMathes, BMStout, SLWatson, BMMergott, DJ Preparation and biological evaluation of conformationally constrained BACE1 inhibitors. Bioorg Med Chem 23:3260-8 (2015)  
Target
Name:
Beta-secretase 1
Synonyms:
ASP2 Aspartyl protease 2 BACE1 Beta-secretase (BACE) Beta-secretase 1 (BACE 1) Beta-secretase 1 (BACE1) Beta-site amyloid precursor protein cleaving enzyme 1 Memapsin-2 beta-Secretase (BACE-1) | beta-Secretase (BACE1)
Type:
Protein
Mol. Mass.:
55755.10
Organism:
Homo sapiens (Human)
Description:
P56817
Residue:
501
  
Inhibitor
Name:
BDBM50092469
Synonyms:
CHEMBL3586132
Type:
Small organic molecule
Emp. Form.:
C17H21Cl2N3O2S
Mol. Mass.:
402.339
SMILES:
Cl.NC1=NC23COCC2(CS1)CC(CC3)NC(=O)c1cccc(Cl)c1
: