Target
Prolyl 4-hydroxylase subunit alpha-1
Ligand
BDBM26114
Substrate
Meas. Tech.
ChEMBL_1500973 (CHEMBL3587050)
pH
7.8±n/a
Ki
2600±n/a nM
Comments
extracted
Citation
 Vasta, JDRaines, RT Selective inhibition of prolyl 4-hydroxylases by bipyridinedicarboxylates. Bioorg Med Chem 23:3081-90 (2015)  
Target
Name:
Prolyl 4-hydroxylase subunit alpha-1
Synonyms:
4-PH alpha-1 P4HA1 Procollagen-proline,2-oxoglutarate-4-dioxygenase subunit alpha-1 | Prolyl 4-hydroxylase subunit alpha-1
Type:
PROTEIN
Mol. Mass.:
61043.51
Organism:
Homo sapiens (Human)
Description:
ChEMBL_103483
Residue:
534
  
Inhibitor
Name:
BDBM26114
Synonyms:
CHEMBL88972 pyridine-2,5-dicarboxylic acid
Type:
Small organic molecule
Emp. Form.:
C7H5NO4
Mol. Mass.:
167.1189
SMILES:
OC(=O)c1ccc(nc1)C(O)=O
: