Target
Interleukin-1 receptor-associated kinase 4
Ligand
BDBM188857
Substrate
Meas. Tech.
ChEMBL_1500328 (CHEMBL3588639)
IC50
99±n/a nM
Citation
 McElroy, WTTan, ZHo, GPaliwal, SLi, GSeganish, WMTulshian, DTata, JFischmann, TOSondey, CBian, HBober, LJackson, JGarlisi, CGDevito, KFossetta, JLundell, DNiu, X Potent and Selective Amidopyrazole Inhibitors of IRAK4 That Are Efficacious in a Rodent Model of Inflammation. ACS Med Chem Lett 6:677-82 (2015)  
Target
Name:
Interleukin-1 receptor-associated kinase 4
Synonyms:
IRAK-4 IRAK4_HUMAN Interleukin-1 receptor-associated kinase 4 (IRAK4) | Renal carcinoma antigen NY-REN-64
Type:
Protein
Mol. Mass.:
51519.08
Organism:
Homo sapiens (Human)
Description:
Q9NWZ3
Residue:
460
  
Inhibitor
Name:
BDBM188857
Synonyms:
US9169260, 123
Type:
Small organic molecule
Emp. Form.:
C22H17N7O
Mol. Mass.:
395.4167
SMILES:
Cc1ccc(cc1)-n1nc(cc1NC(=O)c1cnn2cccnc12)-c1cccnc1
: