Target
Phosphatidylinositol 4,5-bisphosphate 3-kinase catalytic subunit gamma isoform
Ligand
BDBM50093439
Substrate
Meas. Tech.
ChEMBL_1500395 (CHEMBL3587028)
Ki
0.048000±n/a nM
Citation
 Collier, PNMessersmith, DLe Tiran, ABandarage, UKBoucher, CCome, JCottrell, KMDamagnez, VDoran, JDGriffith, JPKhare-Pandit, SKrueger, EBLedeboer, MWLedford, BLiao, YMahajan, SMoody, CSRoday, SWang, TXu, JAronov, AM Discovery of Highly Isoform Selective Thiazolopiperidine Inhibitors of Phosphoinositide 3-Kinase¿. J Med Chem 58:5684-8 (2015)  
Target
Name:
Phosphatidylinositol 4,5-bisphosphate 3-kinase catalytic subunit gamma isoform
Synonyms:
PI3-kinase p110 subunit gamma PI3Kgamma PK3CG_HUMAN Phosphatidylinositol 4,5-bisphosphate 3-kinase (PI3K) Phosphatidylinositol 4,5-bisphosphate 3-kinase catalytic subunit gamma (PI3Kgamma) Phosphatidylinositol 4,5-bisphosphate 3-kinase catalytic subunit gamma isoform (PI3K) Phosphatidylinositol-4,5-bisphosphate 3-kinase catalytic subunit gamma isoform Phosphoinositide 3-kinases gamma (PI3K gamma) p120-PI3K
Type:
Enzyme Subunit
Mol. Mass.:
126470.30
Organism:
Homo sapiens (Human)
Description:
P48736
Residue:
1102
  
Inhibitor
Name:
BDBM50093439
Synonyms:
CHEMBL3586666
Type:
Small organic molecule
Emp. Form.:
C14H16N4O2S
Mol. Mass.:
304.367
SMILES:
COc1cncc(c1)N1CCc2nc(NC(C)=O)sc2C1
: