Target
Poly [ADP-ribose] polymerase tankyrase-1
Ligand
BDBM50094927
Substrate
Meas. Tech.
ChEMBL_1502965 (CHEMBL3591899)
IC50
1.5±n/a nM
Citation
 Kumpan, KNathubhai, AZhang, CWood, PJLloyd, MDThompson, ASHaikarainen, TLehtiö, LThreadgill, MD Structure-based design, synthesis and evaluation in vitro of arylnaphthyridinones, arylpyridopyrimidinones and their tetrahydro derivatives as inhibitors of the tankyrases. Bioorg Med Chem 23:3013-32 (2015)  
Target
Name:
Poly [ADP-ribose] polymerase tankyrase-1
Synonyms:
(ARTD5 or PARP5a) PARPL Poly [ADP-ribose] polymerase tankyrase-1 TINF1 TNKS1 Tankyrase 1 Tankyrase-1 Tankyrase-1 (TNKS1)
Type:
Enzyme
Mol. Mass.:
142058.03
Organism:
Homo sapiens (Human)
Description:
O95271
Residue:
1327
  
Inhibitor
Name:
BDBM50094927
Synonyms:
CHEMBL3589283
Type:
Small organic molecule
Emp. Form.:
C16H15F3N2O
Mol. Mass.:
308.2983
SMILES:
CN1CCCc2c1cc([nH]c2=O)-c1ccc(cc1)C(F)(F)F
: