Target
Poly [ADP-ribose] polymerase tankyrase-1
Ligand
BDBM50318567
Substrate
Meas. Tech.
ChEMBL_1502965 (CHEMBL3591899)
IC50
15±n/a nM
Citation
 Kumpan, KNathubhai, AZhang, CWood, PJLloyd, MDThompson, ASHaikarainen, TLehtiö, LThreadgill, MD Structure-based design, synthesis and evaluation in vitro of arylnaphthyridinones, arylpyridopyrimidinones and their tetrahydro derivatives as inhibitors of the tankyrases. Bioorg Med Chem 23:3013-32 (2015)  
Target
Name:
Poly [ADP-ribose] polymerase tankyrase-1
Synonyms:
(ARTD5 or PARP5a) PARPL Poly [ADP-ribose] polymerase tankyrase-1 TINF1 TNKS1 Tankyrase 1 Tankyrase-1 Tankyrase-1 (TNKS1)
Type:
Enzyme
Mol. Mass.:
142058.03
Organism:
Homo sapiens (Human)
Description:
O95271
Residue:
1327
  
Inhibitor
Name:
BDBM50318567
Synonyms:
2-(4-(Trifluoromethyl)phenyl)-7,8-dihydro-5H-thiopyrano-[4,3-d]pyrimidin-4-ol CHEMBL1086580
Type:
Small organic molecule
Emp. Form.:
C14H11F3N2OS
Mol. Mass.:
312.31
SMILES:
FC(F)(F)c1ccc(cc1)-c1nc2CCSCc2c(=O)[nH]1
: