Target
Interleukin-1 receptor-associated kinase 4
Ligand
BDBM50095531
Substrate
Meas. Tech.
ChEMBL_1504266 (CHEMBL3592269)
IC50
1.000000±n/a nM
Citation
 Lim, JAltman, MDBaker, JBrubaker, JDChen, HChen, YFischmann, TGibeau, CKleinschek, MALeccese, ELesburg, CMaclean, JKMoy, LYMulrooney, EFPresland, JRakhilina, LSmith, GFSteinhuebel, DYang, R Discovery of 5-Amino-N-(1H-pyrazol-4-yl)pyrazolo[1,5-a]pyrimidine-3-carboxamide Inhibitors of IRAK4. ACS Med Chem Lett 6:683-8 (2015)  
Target
Name:
Interleukin-1 receptor-associated kinase 4
Synonyms:
IRAK-4 IRAK4_HUMAN Interleukin-1 receptor-associated kinase 4 (IRAK4) | Renal carcinoma antigen NY-REN-64
Type:
Protein
Mol. Mass.:
51519.08
Organism:
Homo sapiens (Human)
Description:
Q9NWZ3
Residue:
460
  
Inhibitor
Name:
BDBM50095531
Synonyms:
CHEMBL3590493 | US10329294, Example 60
Type:
Small organic molecule
Emp. Form.:
C17H17F5N8O
Mol. Mass.:
444.3619
SMILES:
Cn1cc(NC(=O)c2cnn3ccc(nc23)N2C[C@H](N)CC(F)(F)C2)c(n1)C(F)(F)F
: