Target
Neuronal acetylcholine receptor subunit alpha-3/beta-4
Ligand
BDBM50098450
Substrate
Meas. Tech.
ChEMBL_1504713 (CHEMBL3594849)
Ki
>1000±n/a nM
Citation
 Tomassoli, IGündisch, D The twin drug approach for novel nicotinic acetylcholine receptor ligands. Bioorg Med Chem 23:4375-89 (2015)  
Target
Name:
Neuronal acetylcholine receptor subunit alpha-3/beta-4
Synonyms:
Neuronal acetylcholine receptor protein alpha-3/beta-4 subunit | Neuronal acetylcholine receptor; alpha3/beta4
Type:
Mol. Mass.:
Description:
ASSAY_ID of ChEMBL is 1970247
Components:
This complex has 2 components.
Component 1
Name:
Neuronal acetylcholine receptor subunit beta-4
Synonyms:
ACHB4_HUMAN Cholinergic, Nicotinic Alpha6Beta3Beta4Alpha5 Nicotinic acetylcholine receptor alpha6/alpha3/beta4
Type:
Enzyme Catalytic Domain
Mol. Mass.:
56388.51
Organism:
Homo sapiens (Human)
Description:
Cholinergic, Nicotinic Alpha6Beta3Beta4Alpha5 0 HUMAN::P30926
Residue:
498
  
Component 2
Name:
Neuronal acetylcholine receptor subunit alpha-3
Synonyms:
ACHA3_HUMAN Cholinergic, Nicotinic Alpha3Beta2 Cholinergic, Nicotinic Alpha3Beta4x NACHRA3 Neuronal acetylcholine receptor subunit alpha-3 nicotinic central
Type:
Enzyme Catalytic Domain
Mol. Mass.:
57479.03
Organism:
Homo sapiens (Human)
Description:
Cholinergic, Nicotinic Alpha3Beta2 0 HUMAN::P32297
Residue:
505
  
Inhibitor
Name:
BDBM50098450
Synonyms:
CHEMBL3593847
Type:
Small organic molecule
Emp. Form.:
C16H26FN3O
Mol. Mass.:
295.3955
SMILES:
CN(C)CCOc1cc(F)cc(c1)N1CCCN(C)CC1
: