Target
Serine/threonine-protein kinase B-raf
Ligand
BDBM50096332
Substrate
Meas. Tech.
ChEMBL_1495597 (CHEMBL3578335)
IC50
1.2±n/a nM
Citation
 Henry, JRKaufman, MDPeng, SBAhn, YMCaldwell, TMVogeti, LTelikepalli, HLu, WPHood, MMRutkoski, TJSmith, BDVogeti, SMiller, DWise, SCChun, LZhang, XZhang, YKays, LHipskind, PAWrobleski, ADLobb, KLClay, JMCohen, JDWalgren, JLMcCann, DPatel, PClawson, DKGuo, SManglicmot, DGroshong, CLogan, CStarling, JJFlynn, DL Discovery of 1-(3,3-dimethylbutyl)-3-(2-fluoro-4-methyl-5-(7-methyl-2-(methylamino)pyrido[2,3-d]pyrimidin-6-yl)phenyl)urea (LY3009120) as a pan-RAF inhibitor with minimal paradoxical activation and activity against BRAF or RAS mutant tumor cells. J Med Chem 58:4165-79 (2015)  
Target
Name:
Serine/threonine-protein kinase B-raf
Synonyms:
B-RAF B-Raf proto-oncogene serine/threonine-protein kinase BRAF1 RAFB1 v-Raf murine sarcoma viral oncogene homolog B1
Type:
Serine/threonine-protein kinase
Mol. Mass.:
84446.00
Organism:
Homo sapiens (Human)
Description:
P15056
Residue:
766
  
Inhibitor
Name:
BDBM50096332
Synonyms:
CHEMBL3577115
Type:
Small organic molecule
Emp. Form.:
C25H27FN6O3
Mol. Mass.:
478.5187
SMILES:
CCn1c2cc(NC)ncc2cc(-c2ccc(F)c(NC(=O)Nc3cc(no3)C(C)(C)C)c2)c1=O
: