Target
Kallikrein-1
Ligand
BDBM50098595
Substrate
Meas. Tech.
ChEMBL_1504789 (CHEMBL3595074)
Ki
100±n/a nM
Citation
 Priestley, ESCheney, DLDeLucca, IWei, ALuettgen, JMRendina, ARWong, PCWexler, RR Structure-Based Design of Macrocyclic Coagulation Factor VIIa Inhibitors. J Med Chem 58:6225-36 (2015)  
Target
Name:
Kallikrein-1
Synonyms:
KLK1 Kallikrein 1 Kidney/pancreas/salivary gland kallikrein | Tissue kallikrein
Type:
Enzyme
Mol. Mass.:
28874.69
Organism:
Homo sapiens (Human)
Description:
P06870
Residue:
262
  
Inhibitor
Name:
BDBM50098595
Synonyms:
CHEMBL3594314
Type:
Small organic molecule
Emp. Form.:
C31H33N5O4S
Mol. Mass.:
571.69
SMILES:
CCS(=O)(=O)c1ccc2NC(=O)CCCc3ccc(cc3C)[C@@H](Nc3ccc4c(N)nccc4c3)C(=O)NCc1c2
: