Target
Plasma kallikrein
Ligand
BDBM50098597
Substrate
Meas. Tech.
ChEMBL_1504788 (CHEMBL3595073)
Ki
>6000±n/a nM
Citation
 Priestley, ESCheney, DLDeLucca, IWei, ALuettgen, JMRendina, ARWong, PCWexler, RR Structure-Based Design of Macrocyclic Coagulation Factor VIIa Inhibitors. J Med Chem 58:6225-36 (2015)  
Target
Name:
Plasma kallikrein
Synonyms:
Fletcher factor KLKB1 Kallikrein Plasma kallikrein heavy chain Plasma prekallikrein
Type:
Protein
Mol. Mass.:
71391.16
Organism:
Homo sapiens (Human)
Description:
P03952
Residue:
638
  
Inhibitor
Name:
BDBM50098597
Synonyms:
CHEMBL3594312
Type:
Small organic molecule
Emp. Form.:
C32H35N5O4S
Mol. Mass.:
585.716
SMILES:
CC(C)(C)S(=O)(=O)c1ccc2NC(=O)CCCc3ccc(cc3)C(Nc3ccc4c(N)nccc4c3)C(=O)NCc1c2
: