Target
Sodium-dependent serotonin transporter
Ligand
BDBM50098863
Substrate
Meas. Tech.
ChEMBL_1456968 (CHEMBL3368419)
IC50
425±n/a nM
Citation
 Zheng, YYWeng, ZJXie, PZhu, MYXing, LXLi, JQ Synthesis and pharmacological investigation of aralkyl diamine derivatives as potential triple reuptake inhibitors. Eur J Med Chem 86:219-34 (2014)  
Target
Name:
Sodium-dependent serotonin transporter
Synonyms:
5-HT Transporter 5HTT SC6A4_HUMAN SLC6A4 Serotonin transporter (5HTT) Sodium-dependent serotonin transporter (SERT) | Solute carrier family 6 member 4
Type:
Multi-pass membrane protein
Mol. Mass.:
70322.51
Organism:
Homo sapiens (Human)
Description:
P31645
Residue:
630
  
Inhibitor
Name:
BDBM50098863
Synonyms:
CHEMBL3334796
Type:
Small organic molecule
Emp. Form.:
C17H24N2S
Mol. Mass.:
288.451
SMILES:
CN(C)CCC(N1CCCC1)c1csc2ccccc12
: