Target
Proteasome subunit beta type-8
Ligand
BDBM50099659
Substrate
Meas. Tech.
ChEMBL_1446797 (CHEMBL3371271)
IC50
2.0±n/a nM
Citation
 de Bruin, GHuber, EMXin, BTvan Rooden, EJAl-Ayed, KKim, KBKisselev, AFDriessen, Cvan der Stelt, Mvan der Marel, GAGroll, MOverkleeft, HS Structure-based design of฿1i or฿5i specific inhibitors of human immunoproteasomes. J Med Chem 57:6197-209 (2014)  
Target
Name:
Proteasome subunit beta type-8
Synonyms:
26S proteosome Low molecular mass protein 7 Multicatalytic endopeptidase complex subunit C13 PSMB5i Proteasome component C13 Proteasome subunit beta-5i Y2
Type:
PROTEIN
Mol. Mass.:
30357.49
Organism:
Homo sapiens (Human)
Description:
ChEMBL_1446797
Residue:
276
  
Inhibitor
Name:
BDBM50099659
Synonyms:
CHEMBL3319478
Type:
Small organic molecule
Emp. Form.:
C37H44N4O7
Mol. Mass.:
656.7679
SMILES:
COc1ccc(C[C@H](NC(=O)[C@H](C)NC(=O)CN2CCOCC2)C(=O)N[C@@H](Cc2ccc(cc2)-c2ccccc2)C(=O)[C@@]2(C)CO2)cc1
: