Target
Mu-type opioid receptor
Ligand
BDBM50101315
Substrate
Meas. Tech.
ChEMBL_1454172 (CHEMBL3363202)
Ki
>1000±n/a nM
Citation
 Hirayama, SWada, NNemoto, TIwai, TFujii, HNagase, H Synthesis and Pharmacology of a Novel¿ Opioid Receptor (KOR) Agonist with a 1,3,5-Trioxazatriquinane Skeleton. ACS Med Chem Lett 5:868-72 (2014)  
Target
Name:
Mu-type opioid receptor
Synonyms:
M-OR-1 Mor OPRM_MOUSE Oprm | Oprm1
Type:
Enzyme Catalytic Domain
Mol. Mass.:
44431.62
Organism:
MOUSE
Description:
OPIATE Mu OPRM1 MOUSE::P42866
Residue:
398
  
Inhibitor
Name:
BDBM50101315
Synonyms:
CHEMBL3326353
Type:
Small organic molecule
Emp. Form.:
C20H21NO5
Mol. Mass.:
355.3844
SMILES:
[H][C@]12CO[C@]3([H])N1[C@@]([H])(O[C@@]3(C)c1cccc(O)c1)[C@](C)(O2)c1cccc(O)c1
: