Target
Histone chaperone ASF1A
Ligand
BDBM50101678
Substrate
Meas. Tech.
ChEMBL_1462421 (CHEMBL3395843)
IC50
3000±n/a nM
Citation
 Miknis, GFStevens, SJSmith, LEOstrov, DAChurchill, ME Development of novel Asf1-H3/H4 inhibitors. Bioorg Med Chem Lett 25:963-8 (2015)  
Target
Name:
Histone chaperone ASF1A
Synonyms:
ASF1A Anti-silencing function protein 1 homolog A CIA Histone chaperone ASF1A hAsf1a | hCIA
Type:
PROTEIN
Mol. Mass.:
22950.75
Organism:
Homo sapiens (Human)
Description:
ChEMBL_109562
Residue:
204
  
Inhibitor
Name:
BDBM50101678
Synonyms:
CHEMBL3394920
Type:
Small organic molecule
Emp. Form.:
C16H14BrN3O3
Mol. Mass.:
376.205
SMILES:
CC(=O)Nc1ccc(cc1)C(=O)N\N=C\c1cc(Br)ccc1O
: