Target
Histone chaperone ASF1A
Ligand
BDBM50101738
Substrate
Meas. Tech.
ChEMBL_1462421 (CHEMBL3395843)
IC50
>100000±n/a nM
Citation
 Miknis, GFStevens, SJSmith, LEOstrov, DAChurchill, ME Development of novel Asf1-H3/H4 inhibitors. Bioorg Med Chem Lett 25:963-8 (2015)  
Target
Name:
Histone chaperone ASF1A
Synonyms:
ASF1A Anti-silencing function protein 1 homolog A CIA Histone chaperone ASF1A hAsf1a | hCIA
Type:
PROTEIN
Mol. Mass.:
22950.75
Organism:
Homo sapiens (Human)
Description:
ChEMBL_109562
Residue:
204
  
Inhibitor
Name:
BDBM50101738
Synonyms:
CHEMBL3394899
Type:
Small organic molecule
Emp. Form.:
C14H18BrN3O3
Mol. Mass.:
356.215
SMILES:
COc1cc(\C=N\NC(=O)C2CCNCC2)cc(Br)c1O
: