Target
Solute carrier family 22 member 8
Ligand
BDBM50335563
Substrate
Meas. Tech.
ChEMBL_1482571 (CHEMBL3537392)
IC50
57000±n/a nM
Citation
 Wolman, ATGionfriddo, MRHeindel, GAMukhija, PWitkowski, SBommareddy, AVanwert, AL Organic anion transporter 3 interacts selectively with lipophilicß-lactam antibiotics. Drug Metab Dispos 41:791-800 (2013)  
Target
Name:
Solute carrier family 22 member 8
Synonyms:
Oat3 Organic anion transporter 3 Roct Slc22a8 mOat3
Type:
PROTEIN
Mol. Mass.:
59254.18
Organism:
Mus musculus
Description:
ChEMBL_104613
Residue:
537
  
Inhibitor
Name:
BDBM50335563
Synonyms:
(6R,7R)-3-(carbamoyloxymethyl)-7-methoxy-8-oxo-7-(2-(thiophen-2-yl)acetamido)-5-thia-1-aza-bicyclo[4.2.0]oct-2-ene-2-carboxylic acid (6R,7S)-3-Carbamoyloxymethyl-7-methoxy-8-oxo-7-(2-thiophen-2-yl-acetylamino)-5-thia-1-aza-bicyclo[4.2.0]oct-2-ene-2-carboxylic acid (6S,7R)-3-(carbamoyloxymethyl)-7-methoxy-8-oxo-7-(2-(thiophen-2-yl)acetamido)-5-thia-1-aza-bicyclo[4.2.0]oct-2-ene-2-carboxylic acid 3-Carbamoyloxymethyl-7-methoxy-8-oxo-7-(2-thiophen-2-yl-acetylamino)-5-thia-1-aza-bicyclo[4.2.0]oct-2-ene-2-carboxylic acid 3-Carbamoyloxymethyl-7-methoxy-8-oxo-7-(2-thiophen-3-yl-acetylamino)-5-thia-1-aza-bicyclo[4.2.0]oct-2-ene-2-carboxylic acid anion Cefoxitin Cenomycin Mefoxitin
Type:
Small organic molecule
Emp. Form.:
C16H17N3O7S2
Mol. Mass.:
427.452
SMILES:
CO[C@]1(NC(=O)Cc2cccs2)[C@H]2SCC(COC(N)=O)=C(N2C1=O)C(O)=O
: