Target
Translocator protein
Ligand
BDBM22032
Substrate
Meas. Tech.
ChEMBL_1508094 (CHEMBL3599695)
Ki
9.3±n/a nM
Citation
 Barresi, EBruno, ATaliani, SCosconati, SDa Pozzo, ESalerno, SSimorini, FDaniele, SGiacomelli, CMarini, AMLa Motta, CMarinelli, LCosimelli, BNovellino, EGreco, GDa Settimo, FMartini, C Deepening the Topology of the Translocator Protein Binding Site by Novel N,N-Dialkyl-2-arylindol-3-ylglyoxylamides. J Med Chem 58:6081-92 (2015)  
Target
Name:
Translocator protein
Synonyms:
Benzodiazepine receptors; peripheral & central Mbr PBR Peripheral benzodiazepine receptor (PBR) TSPO_RAT | Tspo
Type:
Mitochondrion membrane protein
Mol. Mass.:
18945.84
Organism:
Rattus norvegicus (rat)
Description:
Competitive binding experiments were performed on rat kidney mitochondrial membranes.
Residue:
169
  
Inhibitor
Name:
BDBM22032
Synonyms:
1-(2-chlorophenyl)-N-methyl-N-(1-methylpropyl)isoquinoline-3-carboxamide N-(butan-2-yl)-1-(2-chlorophenyl)-N-methylisoquinoline-3-carboxamide PK-11195 RP 52028 | [3H]PK 11195
Type:
radiolabeled ligand
Emp. Form.:
C21H21ClN2O
Mol. Mass.:
352.857
SMILES:
CCC(C)N(C)C(=O)c1cc2ccccc2c(n1)-c1ccccc1Cl
: