Target
Adenosylhomocysteinase
Ligand
BDBM50105900
Substrate
Meas. Tech.
ChEMBL_1507790 (CHEMBL3598547)
Ki
1000±n/a nM
Citation
 Nakao, ASuzuki, HUeno, HIwasaki, HSetsuta, TKashima, ASunada, S Discovery and structural analyses of S-adenosyl-L-homocysteine hydrolase inhibitors based on non-adenosine analogs. Bioorg Med Chem 23:4952-69 (2015)  
Target
Name:
Adenosylhomocysteinase
Synonyms:
Adenosylhomocysteinase SAHH_RAT
Type:
PROTEIN
Mol. Mass.:
47537.52
Organism:
Rattus norvegicus
Description:
ChEMBL_1507790
Residue:
432
  
Inhibitor
Name:
BDBM50105900
Synonyms:
CHEMBL11390
Type:
Small organic molecule
Emp. Form.:
C8H11N5O2
Mol. Mass.:
209.2052
SMILES:
Nc1ncnc2n(CC(O)CO)cnc12
: