Target
Dual specificity tyrosine-phosphorylation-regulated kinase 1A
Ligand
BDBM100152
Substrate
Meas. Tech.
ChEMBL_1508044 (CHEMBL3599534)
IC50
80±n/a nM
Citation
 Yadav, RRSharma, SJoshi, PWani, AVishwakarma, RAKumar, ABharate, SB Meridianin derivatives as potent Dyrk1A inhibitors and neuroprotective agents. Bioorg Med Chem Lett 25:2948-52 (2015)  
Target
Name:
Dual specificity tyrosine-phosphorylation-regulated kinase 1A
Synonyms:
DYR1A_HUMAN DYRK1A Dual specificity YAK1-related kinase 1A (Dyrk1A) Dual-specificity tyrosine-phosphorylation regulated kinase 1A HP86 MNBH
Type:
Enzyme
Mol. Mass.:
85616.61
Organism:
Homo sapiens (Human)
Description:
Q13627
Residue:
763
  
Inhibitor
Name:
BDBM100152
Synonyms:
7-methoxy-1-methyl-9H-beta-carboline;hydrochloride HARMINE MLS002153910 cid_5359389
Type:
Small organic molecule
Emp. Form.:
C13H12N2O
Mol. Mass.:
212.2472
SMILES:
COc1ccc2c(c1)[nH]c1c(C)nccc21
: