Target
Dual specificity tyrosine-phosphorylation-regulated kinase 1A
Ligand
BDBM50105918
Substrate
Meas. Tech.
ChEMBL_1508020 (CHEMBL3599390)
IC50
530±n/a nM
Citation
 Yadav, RRSharma, SJoshi, PWani, AVishwakarma, RAKumar, ABharate, SB Meridianin derivatives as potent Dyrk1A inhibitors and neuroprotective agents. Bioorg Med Chem Lett 25:2948-52 (2015)  
Target
Name:
Dual specificity tyrosine-phosphorylation-regulated kinase 1A
Synonyms:
DYR1A_HUMAN DYRK1A Dual specificity YAK1-related kinase 1A (Dyrk1A) Dual-specificity tyrosine-phosphorylation regulated kinase 1A HP86 MNBH
Type:
Enzyme
Mol. Mass.:
85616.61
Organism:
Homo sapiens (Human)
Description:
Q13627
Residue:
763
  
Inhibitor
Name:
BDBM50105918
Synonyms:
CHEMBL3426272
Type:
Small organic molecule
Emp. Form.:
C19H11BrF3N5O4S
Mol. Mass.:
542.286
SMILES:
Nc1nccc(n1)-c1cn(c2ccc(Br)cc12)S(=O)(=O)c1ccc(cc1[N+]([O-])=O)C(F)(F)F
: