Target
Carbonic anhydrase
Ligand
BDBM50278319
Substrate
Meas. Tech.
ChEMBL_1507030 (CHEMBL3599984)
pH
8.3±n/a
Ki
720000±n/a nM
Comments
extracted
Citation
 Pinard, MALotlikar, SRBoone, CDVullo, DSupuran, CTPatrauchan, MAMcKenna, R Structure and inhibition studies of a type II beta-carbonic anhydrase psCA3 from Pseudomonas aeruginosa. Bioorg Med Chem 23:4831-8 (2015)  
Target
Name:
Carbonic anhydrase
Synonyms:
Carbonate dehydratase | Carbonic anhydrase
Type:
PROTEIN
Mol. Mass.:
24220.80
Organism:
Pseudomonas aeruginosa (strain ATCC 15692 / PAO1 / 1C / PRS 101 / LMG12228)
Description:
ChEMBL_109845
Residue:
215
  
Inhibitor
Name:
BDBM50278319
Synonyms:
CHEMBL502764 | sodium persulfate
Type:
Small organic molecule
Emp. Form.:
O8S2
Mol. Mass.:
192.126
SMILES:
[O-]S(=O)(=O)OOS([O-])(=O)=O
: