Target
Albumin
Ligand
BDBM50366816
Substrate
Meas. Tech.
ChEMBL_1509401 (CHEMBL3603344)
Kd
44000±n/a nM
Citation
 Visalli, RJZiobrowski, HBadri, KRHe, JJZhang, XArumugam, SRZhao, H Ionic derivatives of betulinic acid exhibit antiviral activity against herpes simplex virus type-2 (HSV-2), but not HIV-1 reverse transcriptase. Bioorg Med Chem Lett 25:3168-71 (2015)  
Target
Name:
Albumin
Synonyms:
ALB Serum albumin
Type:
PROTEIN
Mol. Mass.:
69362.94
Organism:
Homo sapiens (Human)
Description:
ChEMBL_1509401
Residue:
609
  
Inhibitor
Name:
BDBM50366816
Synonyms:
ABACAVIR Ziagen
Type:
Small organic molecule
Emp. Form.:
C14H18N6O
Mol. Mass.:
286.3323
SMILES:
Nc1nc(NC2CC2)c2ncn([C@@H]3C[C@H](CO)C=C3)c2n1
: