Target
Acetylcholinesterase
Ligand
BDBM50108599
Substrate
Meas. Tech.
ChEMBL_1507810 (CHEMBL3598674)
Kd
109200±n/a nM
Citation
 Valiveti, AKBhalerao, UMAcharya, JKarade, HNAcharya, BNRaviraju, GHalve, AKKaushik, MP Synthesis and in vitro kinetic evaluation of N-thiazolylacetamido monoquaternary pyridinium oximes as reactivators of sarin, O-ethylsarin and VX inhibited human acetylcholinesterase (hAChE). Bioorg Med Chem 23:4899-910 (2015)  
Target
Name:
Acetylcholinesterase
Synonyms:
ACES_HUMAN Acetylcholinesterase (AChE) | Acetylcholinesterase (human AChE)
Type:
Enzyme
Mol. Mass.:
67792.70
Organism:
Homo sapiens (Human)
Description:
P22303
Residue:
614
  
Inhibitor
Name:
BDBM50108599
Synonyms:
CHEMBL3597947
Type:
Small organic molecule
Emp. Form.:
C15H17ClN4O4S
Mol. Mass.:
384.838
SMILES:
[Cl-].CCOC(=O)Cc1csc(NC(=O)C[n+]2cccc(\C=N\O)c2)n1
: