Target
Mast/stem cell growth factor receptor Kit
Ligand
BDBM50112634
Substrate
Meas. Tech.
ChEMBL_1513844 (CHEMBL3611266)
IC50
160±n/a nM
Citation
 Murray, CWBerdini, VBuck, IMCarr, MECleasby, ACoyle, JECurry, JEDay, JEDay, PJHearn, KIqbal, ALee, LYMartins, VMortenson, PNMunck, JMPage, LWPatel, SRoomans, SSmith, KTamanini, ESaxty, G Fragment-Based Discovery of Potent and Selective DDR1/2 Inhibitors. ACS Med Chem Lett 6:798-803 (2015)  
Target
Name:
Mast/stem cell growth factor receptor Kit
Synonyms:
CD117 antigen KIT Mast/stem cell growth factor receptor Kit (cKIT) Proto-oncogene tyrosine-protein kinase Kit Stem cell growth factor receptor Tyrosine-protein kinase Kit c-kit v-kit Hardy-Zuckerman 4 feline sarcoma viral oncogene homolog
Type:
Protein
Mol. Mass.:
109869.37
Organism:
Homo sapiens (Human)
Description:
P10721
Residue:
976
  
Inhibitor
Name:
BDBM50112634
Synonyms:
CHEMBL3608791
Type:
Small organic molecule
Emp. Form.:
C24H20FN5O2
Mol. Mass.:
429.4463
SMILES:
C[C@H](Nc1nc2cc(F)ccc2o1)c1ccc(C)c(NC(=O)c2cnc3ccccn23)c1
: