Target
Metabotropic glutamate receptor 5
Ligand
BDBM50113480
Substrate
Meas. Tech.
ChEMBL_1510803 (CHEMBL3606567)
IC50
200±n/a nM
Citation
 Christopher, JAAves, SJBennett, KADoré, ASErrey, JCJazayeri, AMarshall, FHOkrasa, KSerrano-Vega, MJTehan, BGWiggin, GRCongreve, M Fragment and Structure-Based Drug Discovery for a Class C GPCR: Discovery of the mGlu5 Negative Allosteric Modulator HTL14242 (3-Chloro-5-[6-(5-fluoropyridin-2-yl)pyrimidin-4-yl]benzonitrile). J Med Chem 58:6653-64 (2015)  
Target
Name:
Metabotropic glutamate receptor 5
Synonyms:
GPRC1E GRM5_HUMAN metabotropic glutamate 5 | metabotropic glutamate 5a
Type:
Enzyme
Mol. Mass.:
132484.72
Organism:
Homo sapiens (Human)
Description:
Residue:
1212
  
Inhibitor
Name:
BDBM50113480
Synonyms:
CHEMBL3603927 US10584111, Ex No. 5 | US11584732, Example 5
Type:
Small organic molecule
Emp. Form.:
C15H8ClN5
Mol. Mass.:
293.711
SMILES:
Clc1cc(cc(c1)-c1cc(ncn1)-c1cccnn1)C#N
: