Target
Cannabinoid receptor 2
Ligand
BDBM50116907
Substrate
Meas. Tech.
ChEMBL_1516109 (CHEMBL3615752)
Ki
5.7±n/a nM
Citation
 Ragusa, GGómez-Cañas, MMorales, PHurst, DPDeligia, FPazos, RPinna, GAFernández-Ruiz, JGoya, PReggio, PHJagerovic, NGarcía-Arencibia, MMurineddu, G Synthesis, pharmacological evaluation and docking studies of pyrrole structure-based CB2 receptor antagonists. Eur J Med Chem 101:651-67 (2015)  
Target
Name:
Cannabinoid receptor 2
Synonyms:
CANNABINOID CB2 CB2 CB2B CNR2_HUMAN Cannabinoid CB2 receptor Cannabinoid receptor 2 (CB2R) | hCB2
Type:
G Protein-Coupled Receptor (GPCR)
Mol. Mass.:
39690.94
Organism:
Homo sapiens (Human)
Description:
P34972
Residue:
360
  
Inhibitor
Name:
BDBM50116907
Synonyms:
CHEMBL3613097
Type:
Small organic molecule
Emp. Form.:
C30H35ClN2O
Mol. Mass.:
475.065
SMILES:
Cc1ccc(Cn2cc(cc2-c2ccc(Cl)c(C)c2)C(=O)N[C@@H]2C(C)(C)C3CC[C@@]2(C)C3)cc1
: