Target
LIM domain kinase 2
Ligand
BDBM50117632
Substrate
Meas. Tech.
ChEMBL_1514398 (CHEMBL3615477)
IC50
<1±n/a nM
Citation
 Boland, SBourin, AAlen, JGeraets, JSchroeders, PCastermans, KKindt, NBoumans, NPanitti, LVanormelingen, JFransen, SVan de Velde, SDefert, O Design, synthesis and biological characterization of selective LIMK inhibitors. Bioorg Med Chem Lett 25:4005-10 (2015)  
Target
Name:
LIM domain kinase 2
Synonyms:
LIMK2 | LIMK2_HUMAN
Type:
PROTEIN
Mol. Mass.:
72238.81
Organism:
Homo sapiens (Human)
Description:
ChEMBL_1514398
Residue:
638
  
Inhibitor
Name:
BDBM50117632
Synonyms:
CHEMBL3613609
Type:
Small organic molecule
Emp. Form.:
C26H30N6O3
Mol. Mass.:
474.5548
SMILES:
CN(C)CC1(CCN(CC1)c1ncnc2[nH]cc(C)c12)C(=O)Nc1cccc(c1)C(=O)OCC#C
: