Target
Serine/threonine-protein kinase TNNI3K
Ligand
BDBM50118386
Substrate
Meas. Tech.
ChEMBL_1515051 (CHEMBL3616263)
IC50
16±n/a nM
Citation
 Lawhorn, BGPhilp, JZhao, YLouer, CHammond, MCheung, MFries, HGraves, APShewchuk, LWang, LCottom, JEQi, HZhao, HTotoritis, RZhang, GSchwartz, BLi, HSweitzer, SHolt, DAGatto, GJKallander, LS Identification of Purines and 7-Deazapurines as Potent and Selective Type I Inhibitors of Troponin I-Interacting Kinase (TNNI3K). J Med Chem 58:7431-48 (2015)  
Target
Name:
Serine/threonine-protein kinase TNNI3K
Synonyms:
CARK TNI3K_HUMAN | TNNI3K
Type:
Enzyme Catalytic Domain
Mol. Mass.:
92855.14
Organism:
Homo sapiens (Human)
Description:
gi_7705748
Residue:
835
  
Inhibitor
Name:
BDBM50118386
Synonyms:
CHEMBL3613307
Type:
Small organic molecule
Emp. Form.:
C22H21F3N6O2S
Mol. Mass.:
490.501
SMILES:
CNS(=O)(=O)c1ccc(N(C)C)c(Nc2ncnc3[nH]c(cc23)-c2cccc(c2)C(F)(F)F)c1
: