Target
Branched-chain-amino-acid aminotransferase, mitochondrial
Ligand
BDBM50118672
Substrate
Meas. Tech.
ChEMBL_1516909 (CHEMBL3618962)
IC50
16±n/a nM
Citation
 Bertrand, SMAncellin, NBeaufils, BBingham, RPBorthwick, JABoullay, ABBoursier, ECarter, PSChung, CWChurcher, IDodic, NFouchet, MHFournier, CFrancis, PLGummer, LAHerry, KHobbs, AHobbs, CIHomes, PJamieson, CNicodeme, EPickett, SDReid, IHSimpson, GLSloan, LASmith, SESomers, DOSpitzfaden, CSuckling, CJValko, KWashio, YYoung, RJ The Discovery of in Vivo Active Mitochondrial Branched-Chain Aminotransferase (BCATm) Inhibitors by Hybridizing Fragment and HTS Hits. J Med Chem 58:7140-63 (2015)  
Target
Name:
Branched-chain-amino-acid aminotransferase, mitochondrial
Synonyms:
BCAT(m) BCAT2_HUMAN BCATM Branched-chain-amino-acid aminotransferase, mitochondrial PP18 | Placental protein 18
Type:
PROTEIN
Mol. Mass.:
44297.81
Organism:
Homo sapiens (Human)
Description:
ChEMBL_109874
Residue:
392
  
Inhibitor
Name:
BDBM50118672
Synonyms:
CHEMBL3617082
Type:
Small organic molecule
Emp. Form.:
C18H17ClFN5O
Mol. Mass.:
373.812
SMILES:
CCCCc1cc(=O)n2nc(NCc3ccc(Cl)cc3F)c(C#N)c2[nH]1
: