Target
Mitogen-activated protein kinase 1
Ligand
BDBM120095
Substrate
Meas. Tech.
ChEMBL_1517781 (CHEMBL3620377)
IC50
0.300000±n/a nM
Citation
 Uehling, DEHarris, PA Recent progress on MAP kinase pathway inhibitors. Bioorg Med Chem Lett 25:4047-56 (2015)  
Target
Name:
Mitogen-activated protein kinase 1
Synonyms:
ERK2 Extracellular signal-regulated kinase 2 Extracellular signal-regulated kinase 2 (ERK2) MAPK 2 MK01_HUMAN Mitogen-activated protein kinase 1 (ERK-2) Mitogen-activated protein kinase 2 PRKM2 | p42-MAPK
Type:
Ser/Thr Protein Kinase
Mol. Mass.:
41392.76
Organism:
Homo sapiens (Human)
Description:
P28482
Residue:
360
  
Inhibitor
Name:
BDBM120095
Synonyms:
US10525036, Example GDC-0994 US8697715, 39 | US9259470, 39
Type:
Small organic molecule
Emp. Form.:
C21H18ClFN6O2
Mol. Mass.:
440.858
SMILES:
Cn1nccc1Nc1nccc(n1)-c1ccn([C@H](CO)c2ccc(Cl)c(F)c2)c(=O)c1
: