Target
Disintegrin and metalloproteinase domain-containing protein 17
Ligand
BDBM50122449
Substrate
Meas. Tech.
ChEMBL_1519719 (CHEMBL3624064)
IC50
>10000±n/a nM
Citation
 Ding, YO'Keefe, HDeLorey, JLIsrael, DIMesser, JAChiu, CHSkinner, SRMatico, REMurray-Thompson, MFLi, FClark, MACuozzo, JWArico-Muendel, CMorgan, BA Discovery of Potent and Selective Inhibitors for ADAMTS-4 through DNA-Encoded Library Technology (ELT). ACS Med Chem Lett 6:888-93 (2015)  
Target
Name:
Disintegrin and metalloproteinase domain-containing protein 17
Synonyms:
ADA17_HUMAN CSVP Disintegrin and metalloproteinase domain-containing protein 17 (ADAM17) TNF-alpha convertase TNF-alpha-converting enzyme (TACE) Tumor necrosis factor-α converting enzyme (TACE)
Type:
Enzyme
Mol. Mass.:
93007.89
Organism:
Homo sapiens (Human)
Description:
Residue:
824
  
Inhibitor
Name:
BDBM50122449
Synonyms:
CHEMBL3622483
Type:
Small organic molecule
Emp. Form.:
C38H49N9O3
Mol. Mass.:
679.8542
SMILES:
CCN(C(=O)c1ccc(CNc2nc(NCCN3CCN(C)CC3)nc(n2)N2CCc3cc(OC)c(OC)cc3C2)cc1)c1cccc(C)c1
: