Target
Protein-glutamine gamma-glutamyltransferase 2
Ligand
BDBM81791
Substrate
Meas. Tech.
ChEMBL_1523085 (CHEMBL3631662)
Ki
27000±n/a nM
Citation
 Yi, MCPalanski, BAQuintero, SAPlugis, NMKhosla, C An unprecedented dual antagonist and agonist of human Transglutaminase 2. Bioorg Med Chem Lett 25:4922-6 (2015)  
Target
Name:
Protein-glutamine gamma-glutamyltransferase 2
Synonyms:
Protein-glutamine gamma-glutamyltransferase TGM2 Tissue transglutaminase Transglutaminase 2 (TGM2) Transglutaminase-2
Type:
Protein
Mol. Mass.:
77309.30
Organism:
Homo sapiens (Human)
Description:
P21980
Residue:
687
  
Inhibitor
Name:
BDBM81791
Synonyms:
Dopamine + GPP(NH)p GPP(NH)p(-) | Guanylyl imidodiphosphate
Type:
Emp. Form.:
C10H17N6O13P3
Mol. Mass.:
522.1957
SMILES:
Nc1nc2n(cnc2c(=O)[nH]1)[C@@H]1O[C@H](COP(O)(=O)OP(O)(=O)NP(O)(O)=O)[C@@H](O)[C@H]1O
: