Target
17-beta-hydroxysteroid dehydrogenase type 1
Ligand
BDBM50126977
Substrate
Meas. Tech.
ChEMBL_1524155 (CHEMBL3631240)
IC50
5.0±n/a nM
Citation
 Abdelsamie, ASBey, EGargano, EMvan Koppen, CJEmpting, MFrotscher, M Towards the evaluation in an animal disease model: Fluorinated 17ß-HSD1 inhibitors showing strong activity towards both the human and the rat enzyme. Eur J Med Chem 103:56-68 (2015)  
Target
Name:
17-beta-hydroxysteroid dehydrogenase type 1
Synonyms:
17-beta-HSD 1 17-beta-hydroxysteroid dehydrogenase type 1 20-alpha-HSD E17KSR EDH17B1 EDHB17 Estradiol 17-beta-dehydrogenase 1 (17beta-HSD1) Placental 17-beta-hydroxysteroid dehydrogenase | SDR28C1
Type:
Enzyme
Mol. Mass.:
34945.13
Organism:
Homo sapiens (Human)
Description:
P14061
Residue:
328
  
Inhibitor
Name:
BDBM50126977
Synonyms:
CHEMBL3629591
Type:
Small organic molecule
Emp. Form.:
C21H17F2NO4S2
Mol. Mass.:
449.491
SMILES:
Cc1cc(NS(=O)(=O)C2CC2)cc(c1)-c1ccc(s1)C(=O)c1c(F)ccc(O)c1F
: