Target
Mu-type opioid receptor
Ligand
BDBM50127701
Substrate
Meas. Tech.
ChEMBL_1522819 (CHEMBL3630378)
EC50
0.064300±n/a nM
Citation
 Liu, XZhao, LWang, YMou, LYang, JZhang, YWang, DWang, R Design, synthesis, and evaluation of new endomorphin analogs with enhanced central antinociception after peripheral administration. Bioorg Med Chem Lett 25:5393-7 (2015)  
Target
Name:
Mu-type opioid receptor
Synonyms:
M-OR-1 MOR-1 MUOR1 Mu opiate receptor OPRM1 hMOP | mu-type opioid receptor isoform MOR-1
Type:
G Protein-Coupled Receptor (GPCR)
Mol. Mass.:
44789.51
Organism:
Homo sapiens (Human)
Description:
P35372
Residue:
400
  
Inhibitor
Name:
BDBM50127701
Synonyms:
CHEMBL3627737
Type:
Small organic molecule
Emp. Form.:
C33H36N6O5S
Mol. Mass.:
628.741
SMILES:
N[C@@H](Cc1ccc(O)cc1)C(=O)N1CCC[C@H]1C(=O)N[C@@H](Cc1c[nH]c2ccccc12)C(=O)N[C@@H](C(=C)C(N)=O)c1ccsc1
: